mutism-n
type: LexicalEntry
canonical form: mutism
sense: 14575578-n
part of speech: noun

muteness-n
type: LexicalEntry
canonical form: muteness
sense: 14575578-n
part of speech: noun

14575578-n
type: LexicalConcept
in scheme: en-word.net
definition: the condition of being unable or unwilling to speak
example: her muteness was a consequence of her deafness
ili: i113476
lexfile: noun.state
part of speech: noun
hypernym: 13943868-n