interval-n
type: LexicalEntry
canonical form: interval
sense: 06871829-n
part of speech: noun

musical interval-n
type: LexicalEntry
canonical form: musical interval
sense: 06871829-n
part of speech: noun

06871829-n
type: LexicalConcept
in scheme: en-word.net
definition: the difference in pitch between two notes
ili: i72520
lexfile: noun.communication
part of speech: noun
hypernym: 06827728-n