melodious-a
type: LexicalEntry
canonical form: melodious
sense: https://en-word.net/lemma/melodious-a#01504792-a
part of speech: adjective

melodic-a
type: LexicalEntry
canonical form: melodic
sense: https://en-word.net/lemma/melodic-a#01504792-a
part of speech: adjective

musical-a
type: LexicalEntry
canonical form: musical
sense: https://en-word.net/lemma/musical-a#01504792-a
part of speech: adjective
sense: https://en-word.net/lemma/musical-a#01508304-a
sense: https://en-word.net/lemma/musical-a#01509141-a
sense: https://en-word.net/lemma/musical-a#02879065-a

https://en-word.net/synset/01504792-a
type: LexicalConcept
in scheme: en-word.net
definition: containing or constituting or characterized by pleasing melody
example: the melodious song of a meadowlark
ili: i8236
lexfile: adj.all
part of speech: adjective
similar: 01505184-s
similar: 01505298-s
similar: 01505397-s
similar: 01505500-s
similar: 01505669-s

https://en-word.net/synset/01508304-a
type: LexicalConcept
in scheme: en-word.net
definition: characteristic of or resembling or accompanied by music
example: a musical speaking voice
example: a musical comedy
ili: i8260
lexfile: adj.all
part of speech: adjective
attribute: 04990651-n
similar: 01508605-s
similar: 01508720-s
similar: 01508860-s

https://en-word.net/synset/01509141-a
type: LexicalConcept
in scheme: en-word.net
definition: talented in or devoted to music
example: comes from a very musical family
ili: i8265
lexfile: adj.all
part of speech: adjective
similar: 01509298-s

https://en-word.net/synset/02879065-a
type: LexicalConcept
in scheme: en-word.net
definition: characterized by or capable of producing music
example: a musical evening
example: musical instruments
ili: i16296
lexfile: adj.pert
part of speech: adjective

musical-n
type: LexicalEntry
canonical form: musical
sense: 07032286-n
part of speech: noun

musical comedy-n
type: LexicalEntry
canonical form: musical comedy
sense: 07032286-n
part of speech: noun

musical theater-n
type: LexicalEntry
canonical form: musical theater
sense: 07032286-n
part of speech: noun

07032286-n
type: LexicalConcept
in scheme: en-word.net
definition: a play or film whose action and dialogue is interspersed with singing and dancing
ili: i73554
lexfile: noun.communication
part of speech: noun
hypernym: 07032045-n
hypernym: 06626039-n