mortar-v
type: LexicalEntry
canonical form: mortar
sense: 01364994-v
part of speech: verb

01364994-v
type: LexicalConcept
in scheme: en-word.net
definition: plaster with mortar
example: mortar the wall
ili: i28511
lexfile: verb.contact
part of speech: verb
domain topic: 00610164-n
hypernym: 01363602-v

mortar-n
type: LexicalEntry
canonical form: mortar
sense: 03792248-n
part of speech: noun
sense: 03792434-n
sense: 14980028-n

howitzer-n
type: LexicalEntry
canonical form: howitzer
sense: 03792248-n
part of speech: noun

trench mortar-n
type: LexicalEntry
canonical form: trench mortar
sense: 03792248-n
part of speech: noun

03792248-n
type: LexicalConcept
in scheme: en-word.net
definition: a muzzle-loading high-angle gun with a short barrel that fires shells at high elevations for a short range
ili: i56375
lexfile: noun.artifact
part of speech: noun
hypernym: 03523145-n

03792434-n
type: LexicalConcept
in scheme: en-word.net
definition: a bowl-shaped vessel in which substances can be ground and mixed with a pestle
ili: i56376
lexfile: noun.artifact
part of speech: noun
hypernym: 04538393-n

14980028-n
type: LexicalConcept
in scheme: en-word.net
definition: used as a bond in masonry or for covering a wall
ili: i115729
lexfile: noun.substance
part of speech: noun
hypernym: 14810638-n
mero substance: 14828345-n