morality-n
type: LexicalEntry
canonical form: morality
sense: 04854001-n
part of speech: noun
sense: 09206590-n

04854001-n
type: LexicalConcept
in scheme: en-word.net
definition: concern with the distinction between good and evil or right and wrong; right or good conduct
ili: i62459
lexfile: noun.attribute
part of speech: noun
attribute: https://en-word.net/synset/01552360-a
attribute: https://en-word.net/synset/01553334-a
attribute: https://en-word.net/synset/01911024-a
attribute: https://en-word.net/synset/01911556-a
hypernym: 04731092-n

ethical motive-n
type: LexicalEntry
canonical form: ethical motive
sense: 09206590-n
part of speech: noun

ethics-n
type: LexicalEntry
canonical form: ethics
sense: 09206590-n
part of speech: noun

morals-n
type: LexicalEntry
canonical form: morals
sense: 09206590-n
part of speech: noun

09206590-n
type: LexicalConcept
in scheme: en-word.net
definition: motivation based on ideas of right and wrong
ili: i84906
lexfile: noun.motive
part of speech: noun
hypernym: 00023953-n