momentum-n
type: LexicalEntry
canonical form: momentum
sense: 05036303-n
part of speech: noun
sense: 05042975-n

05036303-n
type: LexicalConcept
in scheme: en-word.net
definition: the product of a body's mass and its velocity
example: the momentum of the particles was deduced from meteoritic velocities
ili: i63429
lexfile: noun.attribute
part of speech: noun
hypernym: 05016354-n

impulse-n
type: LexicalEntry
canonical form: impulse
sense: 05042975-n
part of speech: noun

05042975-n
type: LexicalConcept
in scheme: en-word.net
definition: an impelling force or strength
example: the car's momentum carried it off the road
ili: i63465
lexfile: noun.attribute
part of speech: noun
hypernym: 05042508-n