minister-n
type: LexicalEntry
canonical form: minister
sense: 00586847-n
part of speech: noun
sense: 10003102-n
sense: 10340353-n
sense: 10340521-n

00586847-n
type: LexicalConcept
in scheme: en-word.net
definition: the job of a head of a government department
ili: i38474
lexfile: noun.act
part of speech: noun
domain region: 08879115-n
hypernym: 00586697-n

minister-v
type: LexicalEntry
canonical form: minister
sense: 02451525-v
part of speech: verb
sense: 02555089-v

02451525-v
type: LexicalConcept
in scheme: en-word.net
definition: work as a minister
example: She is ministering in an old parish
ili: i33956
lexfile: verb.social
part of speech: verb
hypernym: 02418610-v

02555089-v
type: LexicalConcept
in scheme: en-word.net
definition: attend to the wants and needs of others
example: I have to minister to my mother all the time
ili: i34441
lexfile: verb.social
part of speech: verb
hypernym: 02555278-v

curate-n
type: LexicalEntry
canonical form: curate
sense: 10003102-n
part of speech: noun

minister of religion-n
type: LexicalEntry
canonical form: minister of religion
sense: 10003102-n
part of speech: noun

parson-n
type: LexicalEntry
canonical form: parson
sense: 10003102-n
part of speech: noun

pastor-n
type: LexicalEntry
canonical form: pastor
sense: 10003102-n
part of speech: noun

rector-n
type: LexicalEntry
canonical form: rector
sense: 10003102-n
part of speech: noun

10003102-n
type: LexicalConcept
in scheme: en-word.net
definition: a person authorized to conduct religious worship
example: clergymen are usually called ministers in Protestant churches
ili: i89344
lexfile: noun.person
part of speech: noun
hypernym: 09946909-n

diplomatic minister-n
type: LexicalEntry
canonical form: diplomatic minister
sense: 10340353-n
part of speech: noun

10340353-n
type: LexicalConcept
in scheme: en-word.net
definition: a diplomat representing one government to another; ranks below ambassador
ili: i91386
lexfile: noun.person
part of speech: noun
hypernym: 10033672-n

government minister-n
type: LexicalEntry
canonical form: government minister
sense: 10340521-n
part of speech: noun

10340521-n
type: LexicalConcept
in scheme: en-word.net
definition: a person appointed to a high office in the government
example: Minister of Finance
ili: i91387
lexfile: noun.person
part of speech: noun
hypernym: 10089452-n