lenience-n
type: LexicalEntry
canonical form: lenience
sense: 04837153-n
part of speech: noun

leniency-n
type: LexicalEntry
canonical form: leniency
sense: 04837153-n
part of speech: noun

mildness-n
type: LexicalEntry
canonical form: mildness
sense: 04837153-n
part of speech: noun
sense: 04918150-n
sense: 14546010-n

lenity-n
type: LexicalEntry
canonical form: lenity
sense: 04837153-n
part of speech: noun

04837153-n
type: LexicalConcept
in scheme: en-word.net
definition: mercifulness as a consequence of being lenient or tolerant
ili: i62375
lexfile: noun.attribute
part of speech: noun
hypernym: 04836513-n

gentleness-n
type: LexicalEntry
canonical form: gentleness
sense: 04918150-n
part of speech: noun

softness-n
type: LexicalEntry
canonical form: softness
sense: 04918150-n
part of speech: noun

04918150-n
type: LexicalConcept
in scheme: en-word.net
definition: acting in a manner that is gentle and mild and even-tempered
example: his fingers have learned gentleness
example: suddenly her gigantic power melted into softness for the baby
example: even in the pulpit there are moments when mildness of manner is not enough
ili: i62796
lexfile: noun.attribute
part of speech: noun
hypernym: 04917312-n

clemency-n
type: LexicalEntry
canonical form: clemency
sense: 14546010-n
part of speech: noun

14546010-n
type: LexicalConcept
in scheme: en-word.net
definition: good weather with comfortable temperatures
ili: i113318
lexfile: noun.state
part of speech: noun
hypernym: 14545715-n