microwave-v
type: LexicalEntry
canonical form: microwave
sense: 00322737-v
part of speech: verb

micro-cook-v
type: LexicalEntry
canonical form: micro-cook
sense: 00322737-v
part of speech: verb

zap-v
type: LexicalEntry
canonical form: zap
sense: 00322737-v
part of speech: verb

nuke-v
type: LexicalEntry
canonical form: nuke
sense: 00322737-v
part of speech: verb

00322737-v
type: LexicalConcept
in scheme: en-word.net
definition: cook or heat in a microwave oven
example: You can microwave the leftovers
ili: i23342
lexfile: verb.change
part of speech: verb
domain topic: 00244785-n
hypernym: 00323648-v

microwave-n
type: LexicalEntry
canonical form: microwave
sense: 03766619-n
part of speech: noun
sense: 11502712-n

microwave oven-n
type: LexicalEntry
canonical form: microwave oven
sense: 03766619-n
part of speech: noun

03766619-n
type: LexicalConcept
in scheme: en-word.net
definition: kitchen appliance that cooks food by passing an electromagnetic wave through it; heat results from the absorption of energy by the water molecules in the food
ili: i56220
lexfile: noun.artifact
part of speech: noun
hypernym: 03625261-n

11502712-n
type: LexicalConcept
in scheme: en-word.net
definition: a short electromagnetic wave (longer than infrared but shorter than radio waves); used for radar and microwave ovens and for transmitting telephone, facsimile, video and data
ili: i97932
lexfile: noun.phenomenon
part of speech: noun
hypernym: 11471253-n