microfilm-v
type: LexicalEntry
canonical form: microfilm
sense: 01716309-v
part of speech: verb

01716309-v
type: LexicalConcept
in scheme: en-word.net
definition: record on microfilm
ili: i30307
lexfile: verb.creation
part of speech: verb
hypernym: 01715824-v

microfilm-n
type: LexicalEntry
canonical form: microfilm
sense: 03764961-n
part of speech: noun

03764961-n
type: LexicalConcept
in scheme: en-word.net
definition: film on which materials are photographed at greatly reduced size; useful for storage; a magnification system is used to read the material
ili: i56212
lexfile: noun.artifact
part of speech: noun
hypernym: 03343766-n