method acting-n
type: LexicalEntry
canonical form: method acting
sense: 00550803-n
part of speech: noun

method-n
type: LexicalEntry
canonical form: method
sense: 00550803-n
part of speech: noun
sense: 05668113-n

00550803-n
type: LexicalConcept
in scheme: en-word.net
definition: an acting technique introduced by Stanislavsky in which the actor recalls emotions or reactions from his or her own life and uses them to identify with the character being portrayed
ili: i38280
lexfile: noun.act
part of speech: noun
hypernym: 00549363-n

05668113-n
type: LexicalConcept
in scheme: en-word.net
definition: a way of doing something, especially a systematic way; implies an orderly logical arrangement (usually in steps)
ili: i66665
lexfile: noun.cognition
part of speech: noun
hypernym: 05624569-n