merchant-n
type: LexicalEntry
canonical form: merchant
sense: 10329563-n
part of speech: noun

merchandiser-n
type: LexicalEntry
canonical form: merchandiser
sense: 10329563-n
part of speech: noun

10329563-n
type: LexicalConcept
in scheme: en-word.net
definition: a businessperson engaged in retail trade
ili: i91316
lexfile: noun.person
part of speech: noun
hypernym: 09902168-n