medicine-n
type: LexicalEntry
canonical form: medicine
sense: 06052606-n
part of speech: noun

medical specialty-n
type: LexicalEntry
canonical form: medical specialty
sense: 06052606-n
part of speech: noun

06052606-n
type: LexicalConcept
in scheme: en-word.net
definition: the branches of medical science that deal with nonsurgical techniques
ili: i68504
lexfile: noun.cognition
part of speech: noun
hypernym: 06055093-n