medical officer-n
type: LexicalEntry
canonical form: medical officer
sense: 10325302-n
part of speech: noun

medic-n
type: LexicalEntry
canonical form: medic
sense: 10325302-n
part of speech: noun

10325302-n
type: LexicalConcept
in scheme: en-word.net
definition: a medical practitioner in the armed forces
ili: i91291
lexfile: noun.person
part of speech: noun
hypernym: 10325469-n