group-n
type: LexicalEntry
canonical form: group
sense: 06026202-n
part of speech: noun

mathematical group-n
type: LexicalEntry
canonical form: mathematical group
sense: 06026202-n
part of speech: noun

06026202-n
type: LexicalConcept
in scheme: en-word.net
definition: a set that is closed, associative, has an identity element and every element has an inverse
ili: i68410
lexfile: noun.cognition
part of speech: noun
hypernym: 08016141-n