mast-n
type: LexicalEntry
canonical form: mast
sense: 03732251-n
part of speech: noun
sense: 03732484-n
sense: 07821848-n
sense: 12300881-n

03732251-n
type: LexicalConcept
in scheme: en-word.net
definition: a vertical spar for supporting sails
ili: i56053
lexfile: noun.artifact
part of speech: noun
hypernym: 04274687-n
mero part: 03733229-n

03732484-n
type: LexicalConcept
in scheme: en-word.net
definition: any sturdy upright pole
ili: i56054
lexfile: noun.artifact
part of speech: noun
hypernym: 03983015-n

07821848-n
type: LexicalConcept
in scheme: en-word.net
definition: nuts of forest trees used as feed for swine
ili: i78136
lexfile: noun.food
part of speech: noun
hypernym: 07816067-n

12300881-n
type: LexicalConcept
in scheme: en-word.net
definition: nuts of forest trees (as beechnuts and acorns) accumulated on the ground
ili: i101585
lexfile: noun.plant
part of speech: noun
hypernym: 13157333-n