masquerade-n
type: LexicalEntry
canonical form: masquerade
sense: 00757537-n
part of speech: noun
sense: 03325464-n
sense: 08270371-n

charade-n
type: LexicalEntry
canonical form: charade
sense: 00757537-n
part of speech: noun

00757537-n
type: LexicalConcept
in scheme: en-word.net
definition: making a false outward show
example: a beggar's masquerade of wealth
ili: i39408
lexfile: noun.act
part of speech: noun
hypernym: 00756299-n

masquerade-v
type: LexicalEntry
canonical form: masquerade
sense: 00839296-v
part of speech: verb
sense: 02152392-v

00839296-v
type: LexicalConcept
in scheme: en-word.net
definition: pretend to be someone or something that you are not
example: he is masquerading as an expert on the internet
example: This silly novel is masquerading as a serious historical treaty
ili: i25834
lexfile: verb.communication
part of speech: verb
hypernym: 00838967-v

02152392-v
type: LexicalConcept
in scheme: en-word.net
definition: take part in a masquerade
ili: i32494
lexfile: verb.perception
part of speech: verb
hypernym: 02163017-v

fancy dress-n
type: LexicalEntry
canonical form: fancy dress
sense: 03325464-n
part of speech: noun

masquerade costume-n
type: LexicalEntry
canonical form: masquerade costume
sense: 03325464-n
part of speech: noun

03325464-n
type: LexicalConcept
in scheme: en-word.net
definition: a costume worn as a disguise at a masquerade party
ili: i53591
lexfile: noun.artifact
part of speech: noun
hypernym: 03118308-n
hypernym: 03211439-n
mero part: 03225908-n
mero part: 03324402-n

masquerade party-n
type: LexicalEntry
canonical form: masquerade party
sense: 08270371-n
part of speech: noun

masque-n
type: LexicalEntry
canonical form: masque
sense: 08270371-n
part of speech: noun

mask-n
type: LexicalEntry
canonical form: mask
sense: 08270371-n
part of speech: noun

08270371-n
type: LexicalConcept
in scheme: en-word.net
definition: a party of guests wearing costumes and masks
ili: i80504
lexfile: noun.group
part of speech: noun
hypernym: 07462241-n