masculine-a
type: LexicalEntry
canonical form: masculine
sense: https://en-word.net/lemma/masculine-a#01486631-a
part of speech: adjective
sense: https://en-word.net/lemma/masculine-a#01489391-a
sense: 02327600-s

https://en-word.net/synset/01486631-a
type: LexicalConcept
in scheme: en-word.net
definition: associated with men and not with women
ili: i8132
lexfile: adj.all
part of speech: adjective
also: https://en-word.net/synset/01479992-a
also: https://en-word.net/synset/01479138-a
also: https://en-word.net/synset/01489391-a
similar: 01486869-s
similar: 01486984-s
similar: 01487257-s

https://en-word.net/synset/01489391-a
type: LexicalConcept
in scheme: en-word.net
definition: male (of grammatical gender)
ili: i8148
lexfile: adj.all
part of speech: adjective
also: https://en-word.net/synset/01486631-a

02327600-s
type: LexicalConcept
in scheme: en-word.net
definition: (music or poetry) ending on an accented beat or syllable
example: a masculine cadence
example: the masculine rhyme of ‘annoy, enjoy’
ili: i12850
lexfile: adj.all
part of speech: adjective satellite
domain topic: 07034009-n
similar: https://en-word.net/synset/02327216-a

masculine-n
type: LexicalEntry
canonical form: masculine
sense: 06340158-n
part of speech: noun

06340158-n
type: LexicalConcept
in scheme: en-word.net
definition: a gender that refers chiefly (but not exclusively) to males or to objects classified as male
ili: i69737
lexfile: noun.communication
part of speech: noun
hypernym: 06339636-n