market-n
type: LexicalEntry
canonical form: market
sense: 01099197-n
part of speech: noun
sense: 03727779-n

marketplace-n
type: LexicalEntry
canonical form: marketplace
sense: 01099197-n
part of speech: noun
sense: 03727779-n

market place-n
type: LexicalEntry
canonical form: market place
sense: 01099197-n
part of speech: noun
sense: 03727779-n

01099197-n
type: LexicalConcept
in scheme: en-word.net
definition: the world of commercial activity where goods and services are bought and sold
example: without competition there would be no market
example: they were driven from the marketplace
ili: i41147
lexfile: noun.act
part of speech: noun
hypernym: 00408356-n
mero part: 01096649-n

mart-n
type: LexicalEntry
canonical form: mart
sense: 03727779-n
part of speech: noun

03727779-n
type: LexicalConcept
in scheme: en-word.net
definition: an area in a town where a public mercantile establishment is set up
ili: i56021
lexfile: noun.artifact
part of speech: noun
hypernym: 03753653-n