marigold-n
type: LexicalEntry
canonical form: marigold
sense: 12040976-n
part of speech: noun

12040976-n
type: LexicalConcept
in scheme: en-word.net
definition: any of various tropical American plants of the genus Tagetes widely cultivated for their showy yellow or orange flowers
ili: i100379
lexfile: noun.plant
part of speech: noun
hypernym: 11690372-n