manicure-v
type: LexicalEntry
canonical form: manicure
sense: 00042210-v
part of speech: verb
sense: 00042372-v

00042210-v
type: LexicalConcept
in scheme: en-word.net
definition: care for (one's hand) by cutting and shaping the nails, etc.
ili: i21981
lexfile: verb.body
part of speech: verb
hypernym: 00040084-v

00042372-v
type: LexicalConcept
in scheme: en-word.net
definition: trim carefully and neatly
example: manicure fingernails
ili: i21982
lexfile: verb.body
part of speech: verb
hypernym: 01555301-v

manicure-n
type: LexicalEntry
canonical form: manicure
sense: 00662026-n
part of speech: noun

00662026-n
type: LexicalConcept
in scheme: en-word.net
definition: professional care for the hands and fingernails
ili: i38898
lexfile: noun.act
part of speech: noun
hypernym: 00656128-n
hypernym: 00262640-n