frenzied-a
type: LexicalEntry
canonical form: frenzied
sense: 02399571-s
part of speech: adjective

manic-a
type: LexicalEntry
canonical form: manic
sense: 02399571-s
part of speech: adjective

02399571-s
type: LexicalConcept
in scheme: en-word.net
definition: affected with or marked by frenzy or mania uncontrolled by reason
example: a frenzied attack
example: a frenzied mob
example: the prosecutor's frenzied denunciation of the accused
  source: H.W.Carter
example: outbursts of drunken violence and manic activity and creativity
ili: i13237
lexfile: adj.all
part of speech: adjective satellite
similar: https://en-word.net/synset/02398903-a