butch-a
type: LexicalEntry
canonical form: butch
sense: 01486869-s
part of speech: adjective

macho-a
type: LexicalEntry
canonical form: macho
sense: 01486869-s
part of speech: adjective

01486869-s
type: LexicalConcept
in scheme: en-word.net
definition: used of men; markedly masculine in appearance or manner
ili: i8133
lexfile: adj.all
part of speech: adjective satellite
similar: https://en-word.net/synset/01486631-a

macho-n
type: LexicalEntry
canonical form: macho
sense: 10298916-n
part of speech: noun

10298916-n
type: LexicalConcept
in scheme: en-word.net
definition: a male exhibiting or characterized by machismo
ili: i91130
lexfile: noun.person
part of speech: noun
hypernym: 09647338-n