macadamize-v
type: LexicalEntry
canonical form: macadamize
sense: 01606339-v
part of speech: verb

macadamise-v
type: LexicalEntry
canonical form: macadamise
sense: 01606339-v
part of speech: verb

tarmac-v
type: LexicalEntry
canonical form: tarmac
sense: 01606339-v
part of speech: verb

macadam-v
type: LexicalEntry
canonical form: macadam
sense: 01606339-v
part of speech: verb

01606339-v
type: LexicalConcept
in scheme: en-word.net
definition: surface with macadam
example: macadam the road
ili: i29764
lexfile: verb.contact
part of speech: verb
hypernym: 01266847-v

tarmacadam-n
type: LexicalEntry
canonical form: tarmacadam
sense: 04401723-n
part of speech: noun

tarmac-n
type: LexicalEntry
canonical form: tarmac
sense: 04401723-n
part of speech: noun

macadam-n
type: LexicalEntry
canonical form: macadam
sense: 04401723-n
part of speech: noun
sense: 15001634-n

04401723-n
type: LexicalConcept
in scheme: en-word.net
definition: a paved surface having compressed layers of broken rocks held together with tar
ili: i60019
lexfile: noun.artifact
part of speech: noun
hypernym: 03906587-n

15001634-n
type: LexicalConcept
in scheme: en-word.net
definition: broken stone used in macadamized roadways
ili: i115846
lexfile: noun.substance
part of speech: noun
hypernym: 15002063-n