lounge lizard-n
type: LexicalEntry
canonical form: lounge lizard
sense: 10294171-n
part of speech: noun

lizard-n
type: LexicalEntry
canonical form: lizard
sense: 10294171-n
part of speech: noun

10294171-n
type: LexicalConcept
in scheme: en-word.net
definition: a man who idles about in the lounges of hotels and bars in search of women who would support him
ili: i91099
lexfile: noun.person
part of speech: noun
exemplifies: 06730109-n
hypernym: 10149001-n