logic-n
type: LexicalEntry
canonical form: logic
sense: 05622811-n
part of speech: noun
sense: 05671913-n
sense: 05880240-n
sense: 06142469-n
sense: 06173467-n

05622811-n
type: LexicalConcept
in scheme: en-word.net
definition: reasoned and reasonable judgment
example: it made a certain kind of logic
ili: i66416
lexfile: noun.cognition
part of speech: noun
hypernym: 05622440-n

logical system-n
type: LexicalEntry
canonical form: logical system
sense: 05671913-n
part of speech: noun

system of logic-n
type: LexicalEntry
canonical form: system of logic
sense: 05671913-n
part of speech: noun

05671913-n
type: LexicalConcept
in scheme: en-word.net
definition: a system of reasoning
ili: i66683
lexfile: noun.cognition
part of speech: noun
hypernym: 05669841-n

05880240-n
type: LexicalConcept
in scheme: en-word.net
definition: the principles that guide reasoning within a given field or situation
example: economic logic requires it
example: by the logic of war
ili: i67729
lexfile: noun.cognition
part of speech: noun
hypernym: 05881099-n

06142469-n
type: LexicalConcept
in scheme: en-word.net
definition: the system of operations performed by a computer that underlies the machine's representation of logical operations
ili: i68814
lexfile: noun.cognition
part of speech: noun
domain topic: 06138021-n
hypernym: 05669841-n

06173467-n
type: LexicalConcept
in scheme: en-word.net
definition: the branch of philosophy that analyzes inference
ili: i68951
lexfile: noun.cognition
part of speech: noun
hypernym: 06168062-n