literature-n
type: LexicalEntry
canonical form: literature
sense: 00611860-n
part of speech: noun
sense: 06179204-n
sense: 06376048-n
sense: 06376547-n

00611860-n
type: LexicalConcept
in scheme: en-word.net
definition: the profession or art of a writer
example: her place in literature is secure
ili: i38636
lexfile: noun.act
part of speech: noun
domain topic: 06376048-n
hypernym: 00611221-n

lit-n
type: LexicalEntry
canonical form: lit
sense: 06179204-n
part of speech: noun

06179204-n
type: LexicalConcept
in scheme: en-word.net
definition: the humanistic study of a body of literature
example: he took a course in Russian lit
ili: i68975
lexfile: noun.cognition
part of speech: noun
domain topic: 06376048-n
hypernym: 06179001-n

06376048-n
type: LexicalConcept
in scheme: en-word.net
definition: creative writing of recognized artistic value
ili: i69924
lexfile: noun.communication
part of speech: noun
hypernym: 06374360-n

06376547-n
type: LexicalConcept
in scheme: en-word.net
definition: published writings in a particular style on a particular subject
example: the technical literature
example: one aspect of Waterloo has not yet been treated in the literature
ili: i69925
lexfile: noun.communication
part of speech: noun
domain topic: 06376048-n
hypernym: 06374360-n