liner-n
type: LexicalEntry
canonical form: liner
sense: 00132428-n
part of speech: noun
sense: 03678353-n
sense: 03678596-n
sense: 03679093-n

line drive-n
type: LexicalEntry
canonical form: line drive
sense: 00132428-n
part of speech: noun

00132428-n
type: LexicalConcept
in scheme: en-word.net
definition: (baseball) a hit that flies straight out from the batter
example: the batter hit a liner to the shortstop
ili: i36100
lexfile: noun.act
part of speech: noun
domain topic: 00472688-n
hypernym: 00129458-n

ocean liner-n
type: LexicalEntry
canonical form: ocean liner
sense: 03678353-n
part of speech: noun

03678353-n
type: LexicalConcept
in scheme: en-word.net
definition: a large commercial ship (especially one that carries passengers on a regular schedule)
ili: i55719
lexfile: noun.artifact
part of speech: noun
hypernym: 03901800-n
mero part: 02935611-n

lining-n
type: LexicalEntry
canonical form: lining
sense: 03678596-n
part of speech: noun
sense: 03679093-n

03678596-n
type: LexicalConcept
in scheme: en-word.net
definition: a piece of cloth that is used as the inside surface of a garment
ili: i55720
lexfile: noun.artifact
part of speech: noun
hypernym: 03938946-n

03679093-n
type: LexicalConcept
in scheme: en-word.net
definition: a protective covering that protects an inside surface
ili: i55723
lexfile: noun.artifact
part of speech: noun
hypernym: 04020673-n