line-v
type: LexicalEntry
canonical form: line
sense: 00223419-v
part of speech: verb
sense: 00455090-v
sense: 01273348-v
sense: 01278925-v
sense: 01585566-v
sense: 02709399-v

00223419-v
type: LexicalConcept
in scheme: en-word.net
definition: reinforce with fabric
example: lined books are more enduring
ili: i22837
lexfile: verb.change
part of speech: verb
hypernym: 00222898-v

00455090-v
type: LexicalConcept
in scheme: en-word.net
definition: fill plentifully
example: line one's pockets
ili: i23991
lexfile: verb.change
part of speech: verb
hypernym: 00453467-v

occupation-n
type: LexicalEntry
canonical form: occupation
sense: 00583425-n
part of speech: noun

business-n
type: LexicalEntry
canonical form: business
sense: 00583425-n
part of speech: noun

job-n
type: LexicalEntry
canonical form: job
sense: 00583425-n
part of speech: noun

line of work-n
type: LexicalEntry
canonical form: line of work
sense: 00583425-n
part of speech: noun

line-n
type: LexicalEntry
canonical form: line
sense: 00583425-n
part of speech: noun
sense: 01206784-n
sense: 02937552-n
sense: 03676175-n
sense: 03676598-n
sense: 03676799-n
sense: 03676994-n
sense: 03952601-n
sense: 04014761-n
sense: 04409192-n
sense: 05756783-n
sense: 05781046-n
sense: 06270774-n
sense: 06638793-n
sense: 06812755-n
sense: 07025650-n
sense: 07026095-n
sense: 07041860-n
sense: 08118903-n
sense: 08393816-n
sense: 08447160-n
sense: 08447525-n
sense: 08610818-n
sense: 08611480-n
sense: 08611842-n
sense: 11495037-n
sense: 13400586-n
sense: 13735108-n
sense: 13886392-n
sense: 13928798-n

00583425-n
type: LexicalConcept
in scheme: en-word.net
definition: the principal activity in your life that you do to earn money
example: he's not in my line of business
ili: i38458
lexfile: noun.act
part of speech: noun
hypernym: 00408356-n

01206784-n
type: LexicalConcept
in scheme: en-word.net
definition: acting in conformity
example: in line with
example: he got out of line
example: toe the line
ili: i41693
lexfile: noun.act
part of speech: noun
hypernym: 01206166-n

01273348-v
type: LexicalConcept
in scheme: en-word.net
definition: cover the interior of
example: line the gloves
example: line a chimney
ili: i28010
lexfile: verb.contact
part of speech: verb
hypernym: 01335412-v

01278925-v
type: LexicalConcept
in scheme: en-word.net
definition: mark with lines
example: sorrow had lined his face
ili: i28046
lexfile: verb.contact
part of speech: verb
hypernym: 01278326-v

trace-v
type: LexicalEntry
canonical form: trace
sense: 01585566-v
part of speech: verb

draw-v
type: LexicalEntry
canonical form: draw
sense: 01585566-v
part of speech: verb

describe-v
type: LexicalEntry
canonical form: describe
sense: 01585566-v
part of speech: verb

delineate-v
type: LexicalEntry
canonical form: delineate
sense: 01585566-v
part of speech: verb

01585566-v
type: LexicalConcept
in scheme: en-word.net
definition: make a mark or lines on a surface
example: draw a line
example: trace the outline of a figure in the sand
ili: i29642
lexfile: verb.contact
part of speech: verb
hypernym: 00509113-v
similar: 01694189-v
similar: 01647006-v

run along-v
type: LexicalEntry
canonical form: run along
sense: 02709399-v
part of speech: verb

02709399-v
type: LexicalConcept
in scheme: en-word.net
definition: be in line with; form a line along
example: trees line the riverbank
ili: i35174
lexfile: verb.stative
part of speech: verb
hypernym: 02696550-v

cable-n
type: LexicalEntry
canonical form: cable
sense: 02937552-n
part of speech: noun

transmission line-n
type: LexicalEntry
canonical form: transmission line
sense: 02937552-n
part of speech: noun

02937552-n
type: LexicalConcept
in scheme: en-word.net
definition: a conductor for transmitting electrical or optical signals or electric power
ili: i51348
lexfile: noun.artifact
part of speech: noun
hypernym: 03093163-n

03676175-n
type: LexicalConcept
in scheme: en-word.net
definition: something (as a cord or rope) that is long and thin and flexible
example: a washing line
ili: i55708
lexfile: noun.artifact
part of speech: noun
hypernym: 00022119-n
mero part: 02848814-n
mero part: 03246606-n

railway line-n
type: LexicalEntry
canonical form: railway line
sense: 03676598-n
part of speech: noun

rail line-n
type: LexicalEntry
canonical form: rail line
sense: 03676598-n
part of speech: noun

03676598-n
type: LexicalConcept
in scheme: en-word.net
definition: the road consisting of railroad track and roadbed
ili: i55709
lexfile: noun.artifact
part of speech: noun
hypernym: 04103160-n
mero part: 04054946-n
mero part: 04055187-n

03676799-n
type: LexicalConcept
in scheme: en-word.net
definition: a commercial organization serving as a common carrier
ili: i55710
lexfile: noun.artifact
part of speech: noun
hypernym: 08074469-n

product line-n
type: LexicalEntry
canonical form: product line
sense: 03676994-n
part of speech: noun

line of products-n
type: LexicalEntry
canonical form: line of products
sense: 03676994-n
part of speech: noun

line of merchandise-n
type: LexicalEntry
canonical form: line of merchandise
sense: 03676994-n
part of speech: noun

business line-n
type: LexicalEntry
canonical form: business line
sense: 03676994-n
part of speech: noun

line of business-n
type: LexicalEntry
canonical form: line of business
sense: 03676994-n
part of speech: noun

03676994-n
type: LexicalConcept
in scheme: en-word.net
definition: a particular kind of product or merchandise
example: a nice line of shoes
ili: i55711
lexfile: noun.artifact
part of speech: noun
hypernym: 03754377-n
mero part: 04462713-n

pipeline-n
type: LexicalEntry
canonical form: pipeline
sense: 03952601-n
part of speech: noun

03952601-n
type: LexicalConcept
in scheme: en-word.net
definition: a pipe used to transport liquids or gases
example: a pipeline runs from the wells to the seaport
ili: i57338
lexfile: noun.artifact
part of speech: noun
hypernym: 03950948-n

production line-n
type: LexicalEntry
canonical form: production line
sense: 04014761-n
part of speech: noun

assembly line-n
type: LexicalEntry
canonical form: assembly line
sense: 04014761-n
part of speech: noun

04014761-n
type: LexicalConcept
in scheme: en-word.net
definition: mechanical system in a factory whereby an article is conveyed through sites at which successive operations are performed on it
ili: i57700
lexfile: noun.artifact
part of speech: noun
hypernym: 03743732-n
mero part: 03105548-n

telephone line-n
type: LexicalEntry
canonical form: telephone line
sense: 04409192-n
part of speech: noun

phone line-n
type: LexicalEntry
canonical form: phone line
sense: 04409192-n
part of speech: noun

telephone circuit-n
type: LexicalEntry
canonical form: telephone circuit
sense: 04409192-n
part of speech: noun

subscriber line-n
type: LexicalEntry
canonical form: subscriber line
sense: 04409192-n
part of speech: noun

04409192-n
type: LexicalConcept
in scheme: en-word.net
definition: a telephone connection
ili: i60070
lexfile: noun.artifact
part of speech: noun
hypernym: 03095830-n

dividing line-n
type: LexicalEntry
canonical form: dividing line
sense: 05756783-n
part of speech: noun

demarcation-n
type: LexicalEntry
canonical form: demarcation
sense: 05756783-n
part of speech: noun

contrast-n
type: LexicalEntry
canonical form: contrast
sense: 05756783-n
part of speech: noun

05756783-n
type: LexicalConcept
in scheme: en-word.net
definition: a conceptual separation or distinction
example: there is a narrow line between sanity and insanity
ili: i67113
lexfile: noun.cognition
part of speech: noun
hypernym: 05756230-n

argumentation-n
type: LexicalEntry
canonical form: argumentation
sense: 05781046-n
part of speech: noun

logical argument-n
type: LexicalEntry
canonical form: logical argument
sense: 05781046-n
part of speech: noun

argument-n
type: LexicalEntry
canonical form: argument
sense: 05781046-n
part of speech: noun

line of reasoning-n
type: LexicalEntry
canonical form: line of reasoning
sense: 05781046-n
part of speech: noun

05781046-n
type: LexicalConcept
in scheme: en-word.net
definition: a course of reasoning aimed at demonstrating a truth or falsehood; the methodical process of logical reasoning
example: I can't follow your line of reasoning
ili: i67228
lexfile: noun.cognition
part of speech: noun
hypernym: 05780353-n

channel-n
type: LexicalEntry
canonical form: channel
sense: 06270774-n
part of speech: noun

communication channel-n
type: LexicalEntry
canonical form: communication channel
sense: 06270774-n
part of speech: noun

06270774-n
type: LexicalConcept
in scheme: en-word.net
definition: (often plural) a means of communication or access
example: it must go through official channels
example: lines of communication were set up between the two firms
ili: i69405
lexfile: noun.communication
part of speech: noun
exemplifies: 06306016-n
hypernym: 06262268-n

note-n
type: LexicalEntry
canonical form: note
sense: 06638793-n
part of speech: noun

short letter-n
type: LexicalEntry
canonical form: short letter
sense: 06638793-n
part of speech: noun

billet-n
type: LexicalEntry
canonical form: billet
sense: 06638793-n
part of speech: noun

06638793-n
type: LexicalConcept
in scheme: en-word.net
definition: a short personal letter
example: drop me a line when you get there
ili: i71301
lexfile: noun.communication
part of speech: noun
hypernym: 06637836-n

06812755-n
type: LexicalConcept
in scheme: en-word.net
definition: a mark that is long relative to its width
example: He drew a line on the chart
ili: i72219
lexfile: noun.communication
part of speech: noun
hypernym: 06811608-n

07025650-n
type: LexicalConcept
in scheme: en-word.net
definition: text consisting of a row of words written across a page or computer screen
example: the letter consisted of three short lines
example: there are six lines in every stanza
ili: i73514
lexfile: noun.communication
part of speech: noun
hypernym: 06399623-n

07026095-n
type: LexicalConcept
in scheme: en-word.net
definition: persuasive but insincere talk that is usually intended to deceive or impress
example: ‘let me show you my etchings’ is a rather worn line
example: he has a smooth line but I didn't fall for it
example: that salesman must have practiced his fast line of talk
ili: i73515
lexfile: noun.communication
part of speech: noun
hypernym: 07259785-n

tune-n
type: LexicalEntry
canonical form: tune
sense: 07041860-n
part of speech: noun

melody-n
type: LexicalEntry
canonical form: melody
sense: 07041860-n
part of speech: noun

air-n
type: LexicalEntry
canonical form: air
sense: 07041860-n
part of speech: noun

strain-n
type: LexicalEntry
canonical form: strain
sense: 07041860-n
part of speech: noun

melodic line-n
type: LexicalEntry
canonical form: melodic line
sense: 07041860-n
part of speech: noun

melodic phrase-n
type: LexicalEntry
canonical form: melodic phrase
sense: 07041860-n
part of speech: noun

07041860-n
type: LexicalConcept
in scheme: en-word.net
definition: a succession of notes forming a distinctive sequence
example: she was humming an air from Beethoven
ili: i73587
lexfile: noun.communication
part of speech: noun
hypernym: 07034009-n
mero part: 07059411-n

lineage-n
type: LexicalEntry
canonical form: lineage
sense: 08118903-n
part of speech: noun

line of descent-n
type: LexicalEntry
canonical form: line of descent
sense: 08118903-n
part of speech: noun

descent-n
type: LexicalEntry
canonical form: descent
sense: 08118903-n
part of speech: noun

bloodline-n
type: LexicalEntry
canonical form: bloodline
sense: 08118903-n
part of speech: noun

blood line-n
type: LexicalEntry
canonical form: blood line
sense: 08118903-n
part of speech: noun

blood-n
type: LexicalEntry
canonical form: blood
sense: 08118903-n
part of speech: noun

pedigree-n
type: LexicalEntry
canonical form: pedigree
sense: 08118903-n
part of speech: noun

ancestry-n
type: LexicalEntry
canonical form: ancestry
sense: 08118903-n
part of speech: noun

origin-n
type: LexicalEntry
canonical form: origin
sense: 08118903-n
part of speech: noun

parentage-n
type: LexicalEntry
canonical form: parentage
sense: 08118903-n
part of speech: noun

stemma-n
type: LexicalEntry
canonical form: stemma
sense: 08118903-n
part of speech: noun

stock-n
type: LexicalEntry
canonical form: stock
sense: 08118903-n
part of speech: noun

08118903-n
type: LexicalConcept
in scheme: en-word.net
definition: the hereditary derivation of an individual
example: his entire lineage has been warriors
ili: i79781
lexfile: noun.group
part of speech: noun
hypernym: 08119368-n

course-n
type: LexicalEntry
canonical form: course
sense: 08393816-n
part of speech: noun

08393816-n
type: LexicalConcept
in scheme: en-word.net
definition: a connected series of events or actions or developments
example: the government took a firm course
example: historians can only point out those lines for which evidence is available
ili: i81129
lexfile: noun.group
part of speech: noun
hypernym: 08474987-n

08447160-n
type: LexicalConcept
in scheme: en-word.net
definition: a formation of people or things one behind another
example: the line stretched clear around the corner
example: you must wait in a long line at the checkout counter
ili: i81420
lexfile: noun.group
part of speech: noun
hypernym: 08443418-n

08447525-n
type: LexicalConcept
in scheme: en-word.net
definition: a formation of people or things one beside another
example: the line of soldiers advanced with their bayonets fixed
example: they were arrayed in line of battle
example: the cast stood in line for the curtain call
ili: i81421
lexfile: noun.group
part of speech: noun
hypernym: 08443418-n

08610818-n
type: LexicalConcept
in scheme: en-word.net
definition: a spatial location defined by a real or imaginary unidimensional extent
ili: i82138
lexfile: noun.location
part of speech: noun
hypernym: 00027365-n

08611480-n
type: LexicalConcept
in scheme: en-word.net
definition: in games or sports; a mark indicating positions or bounds of the playing area
ili: i82139
lexfile: noun.location
part of speech: noun
hypernym: 06811608-n

08611842-n
type: LexicalConcept
in scheme: en-word.net
definition: a fortified position (especially one marking the most forward position of troops)
example: they attacked the enemy's line
ili: i82140
lexfile: noun.location
part of speech: noun
domain topic: 08215965-n
hypernym: 08640161-n

11495037-n
type: LexicalConcept
in scheme: en-word.net
definition: a single frequency (or very narrow band) of radiation in a spectrum
ili: i97893
lexfile: noun.phenomenon
part of speech: noun
hypernym: 11471253-n

credit line-n
type: LexicalEntry
canonical form: credit line
sense: 13400586-n
part of speech: noun

line of credit-n
type: LexicalEntry
canonical form: line of credit
sense: 13400586-n
part of speech: noun

bank line-n
type: LexicalEntry
canonical form: bank line
sense: 13400586-n
part of speech: noun

personal credit line-n
type: LexicalEntry
canonical form: personal credit line
sense: 13400586-n
part of speech: noun

personal line of credit-n
type: LexicalEntry
canonical form: personal line of credit
sense: 13400586-n
part of speech: noun

13400586-n
type: LexicalConcept
in scheme: en-word.net
definition: the maximum credit that a customer is allowed
ili: i107028
lexfile: noun.possession
part of speech: noun
hypernym: 13399691-n

agate line-n
type: LexicalEntry
canonical form: agate line
sense: 13735108-n
part of speech: noun

13735108-n
type: LexicalConcept
in scheme: en-word.net
definition: space for one line of print (one column wide and 1/14 inch deep) used to measure advertising
ili: i108908
lexfile: noun.quantity
part of speech: noun
hypernym: 13621647-n

13886392-n
type: LexicalConcept
in scheme: en-word.net
definition: a length (straight or curved) without breadth or thickness; the trace of a moving point
ili: i109781
lexfile: noun.shape
part of speech: noun
hypernym: 00028005-n

wrinkle-n
type: LexicalEntry
canonical form: wrinkle
sense: 13928798-n
part of speech: noun

furrow-n
type: LexicalEntry
canonical form: furrow
sense: 13928798-n
part of speech: noun

crease-n
type: LexicalEntry
canonical form: crease
sense: 13928798-n
part of speech: noun

crinkle-n
type: LexicalEntry
canonical form: crinkle
sense: 13928798-n
part of speech: noun

seam-n
type: LexicalEntry
canonical form: seam
sense: 13928798-n
part of speech: noun

13928798-n
type: LexicalConcept
in scheme: en-word.net
definition: a slight depression or fold in the smoothness of a surface
example: his face has many lines
example: ironing gets rid of most wrinkles
ili: i110019
lexfile: noun.shape
part of speech: noun
hypernym: 13919062-n