licorice-n
type: LexicalEntry
canonical form: licorice
sense: 07622970-n
part of speech: noun
sense: 12553391-n

liquorice-n
type: LexicalEntry
canonical form: liquorice
sense: 07622970-n
part of speech: noun
sense: 12553391-n

07622970-n
type: LexicalConcept
in scheme: en-word.net
definition: a black candy flavored with the dried root of the licorice plant
ili: i76789
lexfile: noun.food
part of speech: noun
hypernym: 07612936-n

Glycyrrhiza glabra-n
type: LexicalEntry
canonical form: Glycyrrhiza glabra
sense: 12553391-n
part of speech: noun

12553391-n
type: LexicalConcept
in scheme: en-word.net
definition: deep-rooted coarse-textured plant native to the Mediterranean region having blue flowers and pinnately compound leaves; widely cultivated in Europe for its long thick sweet roots
ili: i102780
lexfile: noun.plant
part of speech: noun
hypernym: 12226211-n
mero part: 12553942-n