letup-n
type: LexicalEntry
canonical form: letup
sense: 15299427-n
part of speech: noun

lull-n
type: LexicalEntry
canonical form: lull
sense: 15299427-n
part of speech: noun

15299427-n
type: LexicalConcept
in scheme: en-word.net
definition: a pause during which things are calm or activities are diminished
example: there was never a letup in the noise
ili: i117516
lexfile: noun.time
part of speech: noun
hypernym: 15295994-n