lenience-n
type: LexicalEntry
canonical form: lenience
sense: 01073137-n
part of speech: noun
sense: 04645942-n
sense: 04837153-n

leniency-n
type: LexicalEntry
canonical form: leniency
sense: 01073137-n
part of speech: noun
sense: 04645942-n
sense: 04837153-n

01073137-n
type: LexicalConcept
in scheme: en-word.net
definition: lightening a penalty or excusing from a chore by judges or parents or teachers
ili: i41028
lexfile: noun.act
part of speech: noun
hypernym: 01073014-n

indulgence-n
type: LexicalEntry
canonical form: indulgence
sense: 04645942-n
part of speech: noun

04645942-n
type: LexicalConcept
in scheme: en-word.net
definition: a disposition to yield to the wishes of someone
example: too much indulgence spoils a child
ili: i61450
lexfile: noun.attribute
part of speech: noun
hypernym: 04645280-n

mildness-n
type: LexicalEntry
canonical form: mildness
sense: 04837153-n
part of speech: noun

lenity-n
type: LexicalEntry
canonical form: lenity
sense: 04837153-n
part of speech: noun

04837153-n
type: LexicalConcept
in scheme: en-word.net
definition: mercifulness as a consequence of being lenient or tolerant
ili: i62375
lexfile: noun.attribute
part of speech: noun
hypernym: 04836513-n