legume-n
type: LexicalEntry
canonical form: legume
sense: 11767937-n
part of speech: noun

leguminous plant-n
type: LexicalEntry
canonical form: leguminous plant
sense: 11767937-n
part of speech: noun

11767937-n
type: LexicalConcept
in scheme: en-word.net
definition: an erect or climbing bean or pea plant of the family Leguminosae
ili: i99060
lexfile: noun.plant
part of speech: noun
hypernym: 12226211-n
hypernym: 13123168-n
mero part: 11768471-n