lead-v
type: LexicalEntry
canonical form: lead
sense: 00773677-v
part of speech: verb
sense: 00815452-v
sense: 01736802-v
sense: 02003250-v
sense: 02003455-v
sense: 02003830-v
sense: 02445109-v
sense: 02561616-v
sense: 02641740-v
sense: 02642040-v
sense: 02691775-v
sense: 02692313-v
sense: 02692467-v
sense: 02693227-v

00773677-v
type: LexicalConcept
in scheme: en-word.net
definition: cause to undertake a certain action
example: Her greed led her to forge the checks
ili: i25550
lexfile: verb.communication
part of speech: verb
hypernym: 00772482-v

moderate-v
type: LexicalEntry
canonical form: moderate
sense: 00815452-v
part of speech: verb

chair-v
type: LexicalEntry
canonical form: chair
sense: 00815452-v
part of speech: verb

00815452-v
type: LexicalConcept
in scheme: en-word.net
definition: preside over
example: John moderated the discussion
ili: i25732
lexfile: verb.communication
part of speech: verb
hypernym: 00815640-v

lead-n-1
type: LexicalEntry
canonical form: lead
sense: 01258857-n
part of speech: noun
sense: 01259362-n
sense: 03610056-n
sense: 03656591-n
sense: 03658258-n
sense: 05058239-n
sense: 05164526-n
sense: 05835238-n
sense: 06281532-n
sense: 06281845-n
sense: 06664322-n
sense: 08609721-n
sense: 10668135-n
sense: 13617665-n
sense: 13915822-n

01258857-n
type: LexicalConcept
in scheme: en-word.net
definition: the playing of a card to start a trick in bridge
example: the lead was in the dummy
ili: i41988
lexfile: noun.act
part of speech: noun
hypernym: 00458406-n

01259362-n
type: LexicalConcept
in scheme: en-word.net
definition: a position of being the initiator of something and an example that others will follow (especially in the phrase ‘take the lead’)
example: he takes the lead in any group
example: we were just waiting for someone to take the lead
example: they didn't follow our lead
ili: i41991
lexfile: noun.act
part of speech: noun
hypernym: 01259004-n

conduct-v
type: LexicalEntry
canonical form: conduct
sense: 01736802-v
part of speech: verb
sense: 02003830-v

direct-v
type: LexicalEntry
canonical form: direct
sense: 01736802-v
part of speech: verb
sense: 02003830-v

01736802-v
type: LexicalConcept
in scheme: en-word.net
definition: lead, as in the performance of a composition
example: conduct an orchestra
example: Barenboim conducted the Chicago symphony for years
ili: i30403
lexfile: verb.creation
part of speech: verb
domain topic: 00544270-n
hypernym: 01716563-v
similar: 01737094-v

precede-v
type: LexicalEntry
canonical form: precede
sense: 02003250-v
part of speech: verb

02003250-v
type: LexicalConcept
in scheme: en-word.net
definition: move ahead (of others) in time or space
ili: i31735
lexfile: verb.motion
part of speech: verb
hypernym: 01839438-v

head-v
type: LexicalEntry
canonical form: head
sense: 02003455-v
part of speech: verb
sense: 02445109-v

02003455-v
type: LexicalConcept
in scheme: en-word.net
definition: travel in front of; go in advance of others
example: The procession was headed by John
ili: i31736
lexfile: verb.motion
part of speech: verb
hypernym: 02003250-v
similar: 02734898-v

take-v
type: LexicalEntry
canonical form: take
sense: 02003830-v
part of speech: verb

guide-v
type: LexicalEntry
canonical form: guide
sense: 02003830-v
part of speech: verb

02003830-v
type: LexicalConcept
in scheme: en-word.net
definition: take somebody somewhere
example: we led him to our chief
example: can you take me to the main entrance?
example: He conducted us to the palace
ili: i31738
lexfile: verb.motion
part of speech: verb
hypernym: 02372362-v

02445109-v
type: LexicalConcept
in scheme: en-word.net
definition: be in charge of
example: Who is heading this project?
ili: i33926
lexfile: verb.social
part of speech: verb
hypernym: 02444366-v

contribute-v
type: LexicalEntry
canonical form: contribute
sense: 02561616-v
part of speech: verb

conduce-v
type: LexicalEntry
canonical form: conduce
sense: 02561616-v
part of speech: verb

02561616-v
type: LexicalConcept
in scheme: en-word.net
definition: be conducive to
example: The use of computers in the classroom led to better writing
ili: i34472
lexfile: verb.social
part of speech: verb
hypernym: 02560630-v

leave-v
type: LexicalEntry
canonical form: leave
sense: 02641740-v
part of speech: verb

result-v
type: LexicalEntry
canonical form: result
sense: 02641740-v
part of speech: verb

02641740-v
type: LexicalConcept
in scheme: en-word.net
definition: produce as a result or residue
example: The water left a mark on the silk dress
example: Her blood left a stain on the napkin
ili: i34851
lexfile: verb.stative
part of speech: verb
hypernym: 01756692-v
similar: 02736010-v
similar: 02735289-v

02642040-v
type: LexicalConcept
in scheme: en-word.net
definition: tend to or result in
example: This remark led to further arguments among the guests
ili: i34852
lexfile: verb.stative
part of speech: verb
hypernym: 02641740-v

run-v
type: LexicalEntry
canonical form: run
sense: 02691775-v
part of speech: verb
sense: 02692467-v

go-v
type: LexicalEntry
canonical form: go
sense: 02691775-v
part of speech: verb
sense: 02692313-v

pass-v
type: LexicalEntry
canonical form: pass
sense: 02691775-v
part of speech: verb

extend-v
type: LexicalEntry
canonical form: extend
sense: 02691775-v
part of speech: verb

02691775-v
type: LexicalConcept
in scheme: en-word.net
definition: stretch out over a distance, space, time, or scope; run or extend between two points or beyond a certain point
example: Service runs all the way to Cranbury
example: His knowledge doesn't go very far
example: My memory extends back to my fourth year of life
example: The facts extend beyond a consideration of her personal assets
ili: i35084
lexfile: verb.stative
part of speech: verb
hypernym: 02661230-v
similar: 02732914-v

02692313-v
type: LexicalConcept
in scheme: en-word.net
definition: lead, extend, or afford access
example: This door goes to the basement
example: The road runs South
ili: i35085
lexfile: verb.stative
part of speech: verb
hypernym: 02661230-v

02692467-v
type: LexicalConcept
in scheme: en-word.net
definition: cause something to pass or lead somewhere
example: Run the wire behind the cabinet
ili: i35086
lexfile: verb.stative
part of speech: verb
hypernym: 02056400-v
similar: 01214794-v
similar: 02732914-v

top-v
type: LexicalEntry
canonical form: top
sense: 02693227-v
part of speech: verb

02693227-v
type: LexicalConcept
in scheme: en-word.net
definition: be ahead of others; be the first
example: she topped her class every year
ili: i35090
lexfile: verb.stative
part of speech: verb
entails: 01074673-v
hypernym: 02609706-v

jumper cable-n
type: LexicalEntry
canonical form: jumper cable
sense: 03610056-n
part of speech: noun

jumper lead-n
type: LexicalEntry
canonical form: jumper lead
sense: 03610056-n
part of speech: noun

booster cable-n
type: LexicalEntry
canonical form: booster cable
sense: 03610056-n
part of speech: noun

03610056-n
type: LexicalConcept
in scheme: en-word.net
definition: a jumper that consists of a short piece of wire
example: it was a tangle of jumper cables and clip leads
ili: i55309
lexfile: noun.artifact
part of speech: noun
hypernym: 03609842-n
hypernym: 04601816-n

lead-n-2
type: LexicalEntry
canonical form: lead
sense: 03656410-n
part of speech: noun
sense: 14667645-n

pencil lead-n
type: LexicalEntry
canonical form: pencil lead
sense: 03656410-n
part of speech: noun

03656410-n
type: LexicalConcept
in scheme: en-word.net
definition: mixture of graphite with clay in different degrees of hardness; the marking substance in a pencil
ili: i55592
lexfile: noun.artifact
part of speech: noun
hypernym: 14820745-n

leading-n-1
type: LexicalEntry
canonical form: leading
sense: 03656591-n
part of speech: noun

03656591-n
type: LexicalConcept
in scheme: en-word.net
definition: thin strip of metal used to separate lines of type in printing
ili: i55593
lexfile: noun.artifact
part of speech: noun
hypernym: 04346369-n

leash-n
type: LexicalEntry
canonical form: leash
sense: 03658258-n
part of speech: noun

tether-n
type: LexicalEntry
canonical form: tether
sense: 03658258-n
part of speech: noun

03658258-n
type: LexicalConcept
in scheme: en-word.net
definition: restraint consisting of a rope (or light chain) used to restrain an animal
ili: i55605
lexfile: noun.artifact
part of speech: noun
hypernym: 04088956-n

spark advance-n
type: LexicalEntry
canonical form: spark advance
sense: 05058239-n
part of speech: noun

05058239-n
type: LexicalConcept
in scheme: en-word.net
definition: the timing of ignition relative to the position of the piston in an internal-combustion engine
ili: i63541
lexfile: noun.attribute
part of speech: noun
hypernym: 05053160-n

05164526-n
type: LexicalConcept
in scheme: en-word.net
definition: an advantage held by a competitor in a race
example: he took the lead at the last turn
ili: i64082
lexfile: noun.attribute
part of speech: noun
hypernym: 05163204-n

track-n
type: LexicalEntry
canonical form: track
sense: 05835238-n
part of speech: noun

trail-n
type: LexicalEntry
canonical form: trail
sense: 05835238-n
part of speech: noun

05835238-n
type: LexicalConcept
in scheme: en-word.net
definition: evidence pointing to a possible solution
example: the police are following a promising lead
example: the trail led straight to the perpetrator
ili: i67500
lexfile: noun.cognition
part of speech: noun
hypernym: 05832256-n

lead-in-n
type: LexicalEntry
canonical form: lead-in
sense: 06281532-n
part of speech: noun

lede-n
type: LexicalEntry
canonical form: lede
sense: 06281532-n
part of speech: noun

06281532-n
type: LexicalConcept
in scheme: en-word.net
definition: the introductory section of a story
example: it was an amusing lead-in to a very serious matter
ili: i69461
lexfile: noun.communication
part of speech: noun
hypernym: 06403644-n

lead story-n
type: LexicalEntry
canonical form: lead story
sense: 06281845-n
part of speech: noun

06281845-n
type: LexicalConcept
in scheme: en-word.net
definition: a news story of major importance
ili: i69463
lexfile: noun.communication
part of speech: noun
hypernym: 06279783-n

tip-n
type: LexicalEntry
canonical form: tip
sense: 06664322-n
part of speech: noun

steer-n
type: LexicalEntry
canonical form: steer
sense: 06664322-n
part of speech: noun

confidential information-n
type: LexicalEntry
canonical form: confidential information
sense: 06664322-n
part of speech: noun

wind-n-1
type: LexicalEntry
canonical form: wind
sense: 06664322-n
part of speech: noun

hint-n
type: LexicalEntry
canonical form: hint
sense: 06664322-n
part of speech: noun

06664322-n
type: LexicalConcept
in scheme: en-word.net
definition: an indication of potential opportunity
example: he got a tip on the stock market
example: a good lead for a job
ili: i71436
lexfile: noun.communication
part of speech: noun
hypernym: 06663446-n

08609721-n
type: LexicalConcept
in scheme: en-word.net
definition: (baseball) the position taken by a base runner preparing to advance to the next base
example: he took a long lead off first
ili: i82131
lexfile: noun.location
part of speech: noun
domain topic: 00472688-n
hypernym: 08639173-n

star-n
type: LexicalEntry
canonical form: star
sense: 10668135-n
part of speech: noun

principal-n
type: LexicalEntry
canonical form: principal
sense: 10668135-n
part of speech: noun

10668135-n
type: LexicalConcept
in scheme: en-word.net
definition: an actor who plays a principal role
ili: i93282
lexfile: noun.person
part of speech: noun
hypernym: 09784701-n

13617665-n
type: LexicalConcept
in scheme: en-word.net
definition: (sports) the score by which a team or individual is winning
ili: i108147
lexfile: noun.quantity
part of speech: noun
domain topic: 00524569-n
hypernym: 13615828-n

13915822-n
type: LexicalConcept
in scheme: en-word.net
definition: the angle between the direction a gun is aimed and the position of a moving target (correcting for the flight time of the missile)
ili: i109948
lexfile: noun.shape
part of speech: noun
hypernym: 13910202-n

Pb-n
type: LexicalEntry
canonical form: Pb
sense: 14667645-n
part of speech: noun

atomic number 82-n
type: LexicalEntry
canonical form: atomic number 82
sense: 14667645-n
part of speech: noun

14667645-n
type: LexicalConcept
in scheme: en-word.net
definition: a soft heavy toxic malleable metallic element; bluish white when freshly cut but tarnishes readily to dull grey
example: the children were playing with lead soldiers
ili: i113959
lexfile: noun.substance
part of speech: noun
hypernym: 14649636-n
hypernym: 92464177-n