kite-n
type: LexicalEntry
canonical form: kite
sense: 01611073-n
part of speech: noun
sense: 03626682-n
sense: 13403479-n
sense: 13403644-n

01611073-n
type: LexicalConcept
in scheme: en-word.net
definition: any of several small graceful hawks of the family Accipitridae having long pointed wings and feeding on insects and small animals
ili: i43757
lexfile: noun.animal
part of speech: noun
hypernym: 01608271-n

kite-v
type: LexicalEntry
canonical form: kite
sense: 01852132-v
part of speech: verb
sense: 01946419-v
sense: 02210922-v
sense: 02211095-v

01852132-v
type: LexicalConcept
in scheme: en-word.net
definition: fly a kite
example: Kids were kiting in the park
example: They kited the Red Dragon model
ili: i30951
lexfile: verb.motion
part of speech: verb
hypernym: 01852000-v

01946419-v
type: LexicalConcept
in scheme: en-word.net
definition: soar or fly like a kite
example: The pilot kited for a long time over the mountains
ili: i31434
lexfile: verb.motion
part of speech: verb
domain topic: 00301267-n
hypernym: 01946206-v

02210922-v
type: LexicalConcept
in scheme: en-word.net
definition: get credit or money by using a bad check
example: The businessman kited millions of dollars
ili: i32782
lexfile: verb.possession
part of speech: verb
hypernym: 02242867-v

02211095-v
type: LexicalConcept
in scheme: en-word.net
definition: increase the amount (of a check) fraudulently
example: He kited many checks
ili: i32783
lexfile: verb.possession
part of speech: verb
hypernym: 00153083-v

03626682-n
type: LexicalConcept
in scheme: en-word.net
definition: plaything consisting of a light frame covered with tissue paper; flown in wind at end of a string
ili: i55407
lexfile: noun.artifact
part of speech: noun
hypernym: 03971038-n
mero part: 03627035-n

13403479-n
type: LexicalConcept
in scheme: en-word.net
definition: a bank check drawn on insufficient funds at another bank in order to take advantage of the float
ili: i107044
lexfile: noun.possession
part of speech: noun
hypernym: 13402907-n

13403644-n
type: LexicalConcept
in scheme: en-word.net
definition: a bank check that has been fraudulently altered to increase its face value
ili: i107045
lexfile: noun.possession
part of speech: noun
hypernym: 13402907-n