kettle hole-n
type: LexicalEntry
canonical form: kettle hole
sense: 09347944-n
part of speech: noun

kettle-n
type: LexicalEntry
canonical form: kettle
sense: 09347944-n
part of speech: noun

09347944-n
type: LexicalConcept
in scheme: en-word.net
definition: (geology) a hollow (typically filled by a lake) that results from the melting of a mass of ice trapped in glacial deposits
ili: i85626
lexfile: noun.object
part of speech: noun
domain topic: 06125308-n
hypernym: 09327656-n