kettle-n
type: LexicalEntry
canonical form: kettle
sense: 03618023-n
part of speech: noun
sense: 03618174-n
sense: 09347944-n
sense: 13790294-n

boiler-n
type: LexicalEntry
canonical form: boiler
sense: 03618023-n
part of speech: noun

03618023-n
type: LexicalConcept
in scheme: en-word.net
definition: a metal pot for stewing or boiling; usually has a lid
ili: i55356
lexfile: noun.artifact
part of speech: noun
hypernym: 03996832-n

kettledrum-n
type: LexicalEntry
canonical form: kettledrum
sense: 03618174-n
part of speech: noun

tympanum-n
type: LexicalEntry
canonical form: tympanum
sense: 03618174-n
part of speech: noun

tympani-n
type: LexicalEntry
canonical form: tympani
sense: 03618174-n
part of speech: noun

timpani-n
type: LexicalEntry
canonical form: timpani
sense: 03618174-n
part of speech: noun

03618174-n
type: LexicalConcept
in scheme: en-word.net
definition: a large hemispherical brass or copper percussion instrument with a drumhead that can be tuned by adjusting the tension on it
ili: i55357
lexfile: noun.artifact
part of speech: noun
hypernym: 03921556-n

kettle hole-n
type: LexicalEntry
canonical form: kettle hole
sense: 09347944-n
part of speech: noun

09347944-n
type: LexicalConcept
in scheme: en-word.net
definition: (geology) a hollow (typically filled by a lake) that results from the melting of a mass of ice trapped in glacial deposits
ili: i85626
lexfile: noun.object
part of speech: noun
domain topic: 06125308-n
hypernym: 09327656-n

kettleful-n
type: LexicalEntry
canonical form: kettleful
sense: 13790294-n
part of speech: noun

13790294-n
type: LexicalConcept
in scheme: en-word.net
definition: the quantity a kettle will hold
ili: i109245
lexfile: noun.quantity
part of speech: noun
hypernym: 13778265-n