juiceless-a
type: LexicalEntry
canonical form: juiceless
sense: https://en-word.net/lemma/juiceless-a#01372331-a
part of speech: adjective
sense: 02315409-s

https://en-word.net/synset/01372331-a
type: LexicalConcept
in scheme: en-word.net
definition: lacking juice
ili: i7460
lexfile: adj.all
part of speech: adjective
similar: 01372418-s

dry-a
type: LexicalEntry
canonical form: dry
sense: 02315409-s
part of speech: adjective

02315409-s
type: LexicalConcept
in scheme: en-word.net
definition: lacking interest or stimulation; dull and lifeless
example: a dry book
example: a dry lecture filled with trivial details
example: dull and juiceless as only book knowledge can be when it is unrelated to … life
  source: John Mason Brown
ili: i12779
lexfile: adj.all
part of speech: adjective satellite
similar: https://en-word.net/synset/02315047-a