juggernaut-n
type: LexicalEntry
canonical form: juggernaut
sense: 10246226-n
part of speech: noun

steamroller-n
type: LexicalEntry
canonical form: steamroller
sense: 10246226-n
part of speech: noun

10246226-n
type: LexicalConcept
in scheme: en-word.net
definition: a massive inexorable force that seems to crush everything in its way
ili: i90814
lexfile: noun.person
part of speech: noun
hypernym: 10480990-n