legal separation-n
type: LexicalEntry
canonical form: legal separation
sense: 06553372-n
part of speech: noun

judicial separation-n
type: LexicalEntry
canonical form: judicial separation
sense: 06553372-n
part of speech: noun

06553372-n
type: LexicalConcept
in scheme: en-word.net
definition: a judicial decree regulating the rights and responsibilities of a married couple living apart
ili: i70840
lexfile: noun.communication
part of speech: noun
domain topic: 08458195-n
hypernym: 06551761-n