litigation-n
type: LexicalEntry
canonical form: litigation
sense: 01189300-n
part of speech: noun

judicial proceeding-n
type: LexicalEntry
canonical form: judicial proceeding
sense: 01189300-n
part of speech: noun

01189300-n
type: LexicalConcept
in scheme: en-word.net
definition: a legal proceeding in a court; a judicial contest to determine and enforce legal rights
ili: i41614
lexfile: noun.act
part of speech: noun
domain topic: 08458195-n
hypernym: 01187304-n