jewelry-n
type: LexicalEntry
canonical form: jewelry
sense: 03602662-n
part of speech: noun

jewellery-n
type: LexicalEntry
canonical form: jewellery
sense: 03602662-n
part of speech: noun

03602662-n
type: LexicalConcept
in scheme: en-word.net
definition: an adornment (as a bracelet or ring or necklace) made of precious metals and set with gems (or imitation gems)
ili: i55259
lexfile: noun.artifact
part of speech: noun
hypernym: 02684372-n
mero part: 14723913-n