japan-v
type: LexicalEntry
canonical form: japan
sense: 01686841-v
part of speech: verb

01686841-v
type: LexicalConcept
in scheme: en-word.net
definition: coat with a lacquer, as done in Japan
ili: i30162
lexfile: verb.creation
part of speech: verb
domain topic: 00716196-n
hypernym: 01686656-v

japan-n
type: LexicalEntry
canonical form: japan
sense: 03598409-n
part of speech: noun
sense: 03598549-n

03598409-n
type: LexicalConcept
in scheme: en-word.net
definition: lacquer with a durable glossy black finish, originally from the orient
ili: i55234
lexfile: noun.artifact
part of speech: noun
hypernym: 03637102-n

03598549-n
type: LexicalConcept
in scheme: en-word.net
definition: lacquerware decorated and varnished in the Japanese manner with a glossy durable black lacquer
ili: i55235
lexfile: noun.artifact
part of speech: noun
hypernym: 03637213-n