iodize-v
type: LexicalEntry
canonical form: iodize
sense: 00079922-v
part of speech: verb
sense: 00185052-v

iodise-v
type: LexicalEntry
canonical form: iodise
sense: 00079922-v
part of speech: verb
sense: 00185052-v

00079922-v
type: LexicalConcept
in scheme: en-word.net
definition: treat with iodine so as to prevent infection
example: iodize a wound
ili: i22171
lexfile: verb.body
part of speech: verb
hypernym: 00078513-v

00185052-v
type: LexicalConcept
in scheme: en-word.net
definition: treat with iodine
example: iodize salt
ili: i22634
lexfile: verb.change
part of speech: verb
domain topic: 06094057-n
hypernym: 00516235-v