heady-a
type: LexicalEntry
canonical form: heady
sense: 00925469-s
part of speech: adjective

intoxicating-a
type: LexicalEntry
canonical form: intoxicating
sense: 00925469-s
part of speech: adjective
sense: 01162626-s

00925469-s
type: LexicalConcept
in scheme: en-word.net
definition: extremely exciting as if by alcohol or a narcotic
ili: i5053
lexfile: adj.all
part of speech: adjective satellite
similar: https://en-word.net/synset/00924255-a

intoxicant-a
type: LexicalEntry
canonical form: intoxicant
sense: 01162626-s
part of speech: adjective

01162626-s
type: LexicalConcept
in scheme: en-word.net
definition: causing intoxication
example: an intoxicating drink
ili: i6341
lexfile: adj.all
part of speech: adjective satellite
similar: https://en-word.net/synset/01162103-a