intonation-n
type: LexicalEntry
canonical form: intonation
sense: 00545879-n
part of speech: noun
sense: 01257272-n
sense: 01257565-n
sense: 07098358-n

00545879-n
type: LexicalConcept
in scheme: en-word.net
definition: the production of musical tones (by voice or instrument); especially the exactitude of the pitch relations
ili: i38253
lexfile: noun.act
part of speech: noun
hypernym: 00544270-n

chanting-n
type: LexicalEntry
canonical form: chanting
sense: 01257272-n
part of speech: noun

01257272-n
type: LexicalConcept
in scheme: en-word.net
definition: the act of singing in a monotonous tone
ili: i41977
lexfile: noun.act
part of speech: noun
hypernym: 00546538-n

01257565-n
type: LexicalConcept
in scheme: en-word.net
definition: singing by a soloist of the opening piece of plainsong
ili: i41979
lexfile: noun.act
part of speech: noun
hypernym: 00546538-n

modulation-n
type: LexicalEntry
canonical form: modulation
sense: 07098358-n
part of speech: noun

pitch contour-n
type: LexicalEntry
canonical form: pitch contour
sense: 07098358-n
part of speech: noun

07098358-n
type: LexicalConcept
in scheme: en-word.net
definition: rise and fall of the voice pitch
ili: i73876
lexfile: noun.communication
part of speech: noun
hypernym: 07097924-n