interjection-n
type: LexicalEntry
canonical form: interjection
sense: 01070108-n
part of speech: noun

interposition-n
type: LexicalEntry
canonical form: interposition
sense: 01070108-n
part of speech: noun

interpolation-n
type: LexicalEntry
canonical form: interpolation
sense: 01070108-n
part of speech: noun
sense: 05810738-n
sense: 06734935-n

interpellation-n
type: LexicalEntry
canonical form: interpellation
sense: 01070108-n
part of speech: noun

01070108-n
type: LexicalConcept
in scheme: en-word.net
definition: the action of interjecting or interposing an action or remark that interrupts
ili: i41010
lexfile: noun.act
part of speech: noun
hypernym: 00384760-n

05810738-n
type: LexicalConcept
in scheme: en-word.net
definition: (mathematics) calculation of the value of a function between the values already known
ili: i67377
lexfile: noun.cognition
part of speech: noun
domain topic: 06009822-n
hypernym: 05810193-n

insertion-n
type: LexicalEntry
canonical form: insertion
sense: 06734935-n
part of speech: noun

06734935-n
type: LexicalConcept
in scheme: en-word.net
definition: a message (spoken or written) that is introduced or inserted
example: with the help of his friend's interpolations his story was eventually told
example: with many insertions in the margins
ili: i71832
lexfile: noun.communication
part of speech: noun
hypernym: 06611268-n