interface-n
type: LexicalEntry
canonical form: interface
sense: 03583604-n
part of speech: noun
sense: 03583825-n
sense: 05772776-n
sense: 06587403-n

03583604-n
type: LexicalConcept
in scheme: en-word.net
definition: (chemistry) a surface forming a common boundary between two things (two objects or liquids or chemical phases)
ili: i55145
lexfile: noun.artifact
part of speech: noun
domain topic: 06099035-n
hypernym: 08677970-n

port-n
type: LexicalEntry
canonical form: port
sense: 03583825-n
part of speech: noun

03583825-n
type: LexicalConcept
in scheme: en-word.net
definition: (computer science) computer circuit consisting of the hardware and associated circuitry that links one device with another (especially a computer and a hard disk drive or other peripherals)
ili: i55146
lexfile: noun.artifact
part of speech: noun
domain topic: 06138021-n
hypernym: 03088462-n

05772776-n
type: LexicalConcept
in scheme: en-word.net
definition: the overlap where two theories or phenomena affect each other or have links with each other
example: the interface between chemistry and biology
ili: i67191
lexfile: noun.cognition
part of speech: noun
hypernym: 05772362-n

user interface-n
type: LexicalEntry
canonical form: user interface
sense: 06587403-n
part of speech: noun

06587403-n
type: LexicalConcept
in scheme: en-word.net
definition: (computer science) a program that controls a display for the user (usually on a computer monitor) and that allows the user to interact with the system
ili: i71007
lexfile: noun.communication
part of speech: noun
domain topic: 06138021-n
hypernym: 06581154-n