interconnect-v
type: LexicalEntry
canonical form: interconnect
sense: 01358349-v
part of speech: verb
sense: 02629050-v

interlink-v
type: LexicalEntry
canonical form: interlink
sense: 01358349-v
part of speech: verb
sense: 02629050-v

01358349-v
type: LexicalConcept
in scheme: en-word.net
definition: cause to be interconnected or interwoven
ili: i28472
lexfile: verb.contact
part of speech: verb
hypernym: 01357376-v

complect-v
type: LexicalEntry
canonical form: complect
sense: 02629050-v
part of speech: verb

02629050-v
type: LexicalConcept
in scheme: en-word.net
definition: be interwoven or interconnected
example: The bones are interconnected via the muscle
ili: i34787
lexfile: verb.stative
part of speech: verb
hypernym: 02628315-v