interact-v
type: LexicalEntry
canonical form: interact
sense: 02382049-v
part of speech: verb

02382049-v
type: LexicalConcept
in scheme: en-word.net
definition: act together or towards others or with others
example: He should interact more with his colleagues
ili: i33643
lexfile: verb.social
part of speech: verb
hypernym: 02372362-v